This report was generated on Wednesday, 23-Feb-22 22:48:15 CET using arduino-testlib.
Version: 1.1.2
More details
Board | Claims compatibility | Inclusion | SoftwareSerialExample |
AllFunctionExample |
BasicExample |
BasicExamplePlusDebug |
---|---|---|---|---|---|---|
arduino:avr:uno
1.8.4 |
Yes | PASS | PASS | PASS | PASS | PASS |
arduino:mbed_nano:nanorp2040connect
2.7.2 |
Yes | PASS | FAIL | FAIL | PASS | FAIL |
arduino:megaavr:nona4809
1.8.7 |
Yes | PASS | PASS | PASS | PASS | PASS |
arduino:samd:mkrwifi1010
1.8.12 |
Yes | PASS | FAIL | FAIL | PASS | FAIL |
esp32:esp32:d1_mini32
1.0.6 |
Yes | PASS | PASS | FAIL | PASS | PASS |
Result: PASS
This library has no main header file so an empty one was created.
Sketch uses 444 bytes (1%) of program storage space. Maximum is 32256 bytes. Global variables use 9 bytes (0%) of dynamic memory, leaving 2039 bytes for local variables. Maximum is 2048 bytes.
Result: PASS
Sketch uses 5940 bytes (18%) of program storage space. Maximum is 32256 bytes. Global variables use 344 bytes (16%) of dynamic memory, leaving 1704 bytes for local variables. Maximum is 2048 bytes.
Result: PASS
Sketch uses 3020 bytes (9%) of program storage space. Maximum is 32256 bytes. Global variables use 203 bytes (9%) of dynamic memory, leaving 1845 bytes for local variables. Maximum is 2048 bytes.
Result: PASS
Sketch uses 4304 bytes (13%) of program storage space. Maximum is 32256 bytes. Global variables use 320 bytes (15%) of dynamic memory, leaving 1728 bytes for local variables. Maximum is 2048 bytes.
Result: PASS
Sketch uses 3400 bytes (10%) of program storage space. Maximum is 32256 bytes. Global variables use 145 bytes (7%) of dynamic memory, leaving 1903 bytes for local variables. Maximum is 2048 bytes.
Result: PASS
Sketch uses 78756 bytes (0%) of program storage space. Maximum is 16777216 bytes. Global variables use 43444 bytes (16%) of dynamic memory, leaving 226892 bytes for local variables. Maximum is 270336 bytes.
Result: FAIL
/home/ec2-user/arduino-testlib/cli-datadir/user/libraries/Dabble/src/SoftwareSerial.cpp:45:10: fatal error: util/delay_basic.h: No such file or directory #include <util/delay_basic.h> ^~~~~~~~~~~~~~~~~~~~ compilation terminated. Multiple libraries were found for "SoftwareSerial.h" Used: /home/ec2-user/arduino-testlib/cli-datadir/user/libraries/Dabble Not used: /home/ec2-user/arduino-testlib/cli-datadir/user/libraries/EspSoftwareSerial Not used: /home/ec2-user/arduino-testlib/cli-datadir/user/libraries/Printoo_Library
Result: PASS
Sketch uses 79684 bytes (0%) of program storage space. Maximum is 16777216 bytes. Global variables use 43468 bytes (16%) of dynamic memory, leaving 226868 bytes for local variables. Maximum is 270336 bytes.
Result: FAIL
/home/ec2-user/arduino-testlib/cli-datadir/user/libraries/Dabble/src/SoftwareSerial.cpp:45:10: fatal error: util/delay_basic.h: No such file or directory #include <util/delay_basic.h> ^~~~~~~~~~~~~~~~~~~~ compilation terminated. Multiple libraries were found for "SoftwareSerial.h" Used: /home/ec2-user/arduino-testlib/cli-datadir/user/libraries/Dabble Not used: /home/ec2-user/arduino-testlib/cli-datadir/user/libraries/EspSoftwareSerial Not used: /home/ec2-user/arduino-testlib/cli-datadir/user/libraries/Printoo_Library
Result: FAIL
/home/ec2-user/arduino-testlib/cli-datadir/user/libraries/Dabble/src/SoftwareSerial.cpp:45:10: fatal error: util/delay_basic.h: No such file or directory #include <util/delay_basic.h> ^~~~~~~~~~~~~~~~~~~~ compilation terminated. Multiple libraries were found for "SoftwareSerial.h" Used: /home/ec2-user/arduino-testlib/cli-datadir/user/libraries/Dabble Not used: /home/ec2-user/arduino-testlib/cli-datadir/user/libraries/Printoo_Library Not used: /home/ec2-user/arduino-testlib/cli-datadir/user/libraries/EspSoftwareSerial
Result: PASS
Sketch uses 802 bytes (1%) of program storage space. Maximum is 49152 bytes. Global variables use 22 bytes (0%) of dynamic memory, leaving 6122 bytes for local variables. Maximum is 6144 bytes.
Result: PASS
Sketch uses 7114 bytes (14%) of program storage space. Maximum is 49152 bytes. Global variables use 487 bytes (7%) of dynamic memory, leaving 5657 bytes for local variables. Maximum is 6144 bytes.
Result: PASS
Sketch uses 3946 bytes (8%) of program storage space. Maximum is 49152 bytes. Global variables use 196 bytes (3%) of dynamic memory, leaving 5948 bytes for local variables. Maximum is 6144 bytes.
Result: PASS
Sketch uses 5684 bytes (11%) of program storage space. Maximum is 49152 bytes. Global variables use 487 bytes (7%) of dynamic memory, leaving 5657 bytes for local variables. Maximum is 6144 bytes.
Result: PASS
Sketch uses 4228 bytes (8%) of program storage space. Maximum is 49152 bytes. Global variables use 332 bytes (5%) of dynamic memory, leaving 5812 bytes for local variables. Maximum is 6144 bytes.
Result: PASS
This library has no main header file so an empty one was created.
Sketch uses 12156 bytes (4%) of program storage space. Maximum is 262144 bytes. Global variables use 2996 bytes (9%) of dynamic memory, leaving 29772 bytes for local variables. Maximum is 32768 bytes.
Result: FAIL
/Users/alranel/Documents/git/arduino/arduino-testlib/cli-datadir/user/libraries/Dabble/src/SoftwareSerial.cpp:45:10: fatal error: util/delay_basic.h: No such file or directory #include <util/delay_basic.h> ^~~~~~~~~~~~~~~~~~~~ compilation terminated. Multiple libraries were found for "SoftwareSerial.h" Used: /Users/alranel/Documents/git/arduino/arduino-testlib/cli-datadir/user/libraries/Dabble Not used: /Users/alranel/Documents/git/arduino/arduino-testlib/cli-datadir/user/libraries/EspSoftwareSerial Not used: /Users/alranel/Documents/git/arduino/arduino-testlib/cli-datadir/user/libraries/Printoo_Library
Result: PASS
Sketch uses 12760 bytes (4%) of program storage space. Maximum is 262144 bytes. Global variables use 3016 bytes (9%) of dynamic memory, leaving 29752 bytes for local variables. Maximum is 32768 bytes.
Result: FAIL
/Users/alranel/Documents/git/arduino/arduino-testlib/cli-datadir/user/libraries/Dabble/src/SoftwareSerial.cpp:45:10: fatal error: util/delay_basic.h: No such file or directory #include <util/delay_basic.h> ^~~~~~~~~~~~~~~~~~~~ compilation terminated. Multiple libraries were found for "SoftwareSerial.h" Used: /Users/alranel/Documents/git/arduino/arduino-testlib/cli-datadir/user/libraries/Dabble Not used: /Users/alranel/Documents/git/arduino/arduino-testlib/cli-datadir/user/libraries/Printoo_Library Not used: /Users/alranel/Documents/git/arduino/arduino-testlib/cli-datadir/user/libraries/EspSoftwareSerial
Result: FAIL
/Users/alranel/Documents/git/arduino/arduino-testlib/cli-datadir/user/libraries/Dabble/src/SoftwareSerial.cpp:45:10: fatal error: util/delay_basic.h: No such file or directory #include <util/delay_basic.h> ^~~~~~~~~~~~~~~~~~~~ compilation terminated. Multiple libraries were found for "SoftwareSerial.h" Used: /Users/alranel/Documents/git/arduino/arduino-testlib/cli-datadir/user/libraries/Dabble Not used: /Users/alranel/Documents/git/arduino/arduino-testlib/cli-datadir/user/libraries/EspSoftwareSerial Not used: /Users/alranel/Documents/git/arduino/arduino-testlib/cli-datadir/user/libraries/Printoo_Library
Result: PASS
Sketch uses 198434 bytes (15%) of program storage space. Maximum is 1310720 bytes. Global variables use 13096 bytes (3%) of dynamic memory, leaving 314584 bytes for local variables. Maximum is 327680 bytes.
Result: FAIL
/home/ec2-user/arduino-testlib/cli-datadir/user/libraries/BM64_Library/examples/AllFunctionExample/AllFunctionExample.ino: In function 'void loop()': /home/ec2-user/arduino-testlib/cli-datadir/user/libraries/BM64_Library/examples/AllFunctionExample/AllFunctionExample.ino:71:14: error: jump to case label [-fpermissive] case 'j': ^ /home/ec2-user/arduino-testlib/cli-datadir/user/libraries/BM64_Library/examples/AllFunctionExample/AllFunctionExample.ino:68:20: note: crosses initialization of 'String number_s' String number_s = "1234567890"; ^ Multiple libraries were found for "SoftwareSerial.h" Used: /home/ec2-user/arduino-testlib/cli-datadir/user/libraries/EspSoftwareSerial Not used: /home/ec2-user/arduino-testlib/cli-datadir/user/libraries/Dabble Not used: /home/ec2-user/arduino-testlib/cli-datadir/user/libraries/Printoo_Library
Result: PASS
Sketch uses 205578 bytes (15%) of program storage space. Maximum is 1310720 bytes. Global variables use 13440 bytes (4%) of dynamic memory, leaving 314240 bytes for local variables. Maximum is 327680 bytes.
Result: PASS
Sketch uses 263526 bytes (20%) of program storage space. Maximum is 1310720 bytes. Global variables use 14384 bytes (4%) of dynamic memory, leaving 313296 bytes for local variables. Maximum is 327680 bytes.
Result: PASS
Sketch uses 258710 bytes (19%) of program storage space. Maximum is 1310720 bytes. Global variables use 14240 bytes (4%) of dynamic memory, leaving 313440 bytes for local variables. Maximum is 327680 bytes.