DS18B20Events - compatibility matrix

This report was generated on Wednesday, 23-Feb-22 22:48:15 CET using arduino-testlib.

DS18B20Events

Version: 1.0.0
More details

Compatibility matrix

Board Claims compatibility Inclusion
arduino:avr:uno
1.8.4
Yes PASS
arduino:mbed_nano:nanorp2040connect
2.7.2
Yes ⚠️ FAIL
arduino:megaavr:nona4809
1.8.7
Yes ⚠️ FAIL
arduino:samd:mkrwifi1010
1.8.12
Yes PASS
esp32:esp32:d1_mini32
1.0.6
Yes ⚠️ FAIL

Compilation logs

arduino:avr:uno @ 1.8.4

Inclusion

Result: PASS

Sketch uses 444 bytes (1%) of program storage space. Maximum is 32256 bytes.
Global variables use 9 bytes (0%) of dynamic memory, leaving 2039 bytes for local variables. Maximum is 2048 bytes.

arduino:mbed_nano:nanorp2040connect @ 2.7.2

Inclusion

Result: FAIL

In file included from /tmp/arduino-testlib2791861648/test/test.ino:1:0:
/home/ec2-user/arduino-testlib/cli-datadir/user/libraries/DS18B20Events/src/DS18B20Events.h:5:11: fatal error: arduino.h: No such file or directory
  #include "arduino.h"
           ^~~~~~~~~~~
compilation terminated.

arduino:megaavr:nona4809 @ 1.8.7

Inclusion

Result: FAIL

In file included from /tmp/arduino-testlib2791861648/test/test.ino:1:0:
/home/ec2-user/arduino-testlib/cli-datadir/user/libraries/DS18B20Events/src/DS18B20Events.h:5:11: fatal error: arduino.h: No such file or directory
  #include "arduino.h"
           ^~~~~~~~~~~
compilation terminated.

arduino:samd:mkrwifi1010 @ 1.8.12

Inclusion

Result: PASS

Sketch uses 12156 bytes (4%) of program storage space. Maximum is 262144 bytes.
Global variables use 2996 bytes (9%) of dynamic memory, leaving 29772 bytes for local variables. Maximum is 32768 bytes.

esp32:esp32:d1_mini32 @ 1.0.6

Inclusion

Result: FAIL

In file included from /tmp/arduino-testlib2074307947/test/test.ino:1:0:
/home/ec2-user/arduino-testlib/cli-datadir/user/libraries/DS18B20Events/src/DS18B20Events.h:5:22: fatal error: arduino.h: No such file or directory
compilation terminated.