This report was generated on Wednesday, 23-Feb-22 22:48:15 CET using arduino-testlib.
Version: 1.4.0
More details
Board | Claims compatibility | Inclusion | Basics |
Tests |
---|---|---|---|---|
arduino:avr:uno
1.8.4 |
No | FAIL | FAIL | FAIL |
arduino:mbed_nano:nanorp2040connect
2.7.2 |
No | FAIL | FAIL | FAIL |
arduino:megaavr:nona4809
1.8.7 |
No | FAIL | FAIL | FAIL |
arduino:samd:mkrwifi1010
1.8.12 |
No | FAIL | FAIL | FAIL |
esp32:esp32:d1_mini32
1.0.6 |
Yes ⚠️ | FAIL | FAIL | FAIL |
Result: FAIL
In file included from /home/ec2-user/arduino-testlib/cli-datadir/user/libraries/ESP32-Chimera-Core/src/ESP32-Chimera-Core.h:5:0, from /tmp/arduino-testlib2292858031/test/test.ino:1: /home/ec2-user/arduino-testlib/cli-datadir/user/libraries/ESP32-Chimera-Core/src/ESP32-Chimera-Core.hpp:7:4: error: #error “This library only supports boards with ESP32 family processors” #error “This library only supports boards with ESP32 family processors” ^~~~~ In file included from /home/ec2-user/arduino-testlib/cli-datadir/user/libraries/ESP32-Chimera-Core/src/ESP32-Chimera-Core.h:5:0, from /tmp/arduino-testlib2292858031/test/test.ino:1: /home/ec2-user/arduino-testlib/cli-datadir/user/libraries/ESP32-Chimera-Core/src/ESP32-Chimera-Core.hpp:16:10: fatal error: FS.h: No such file or directory #include <FS.h> ^~~~~~ compilation terminated.
Result: FAIL
Result: FAIL
Result: FAIL
In file included from /home/ec2-user/arduino-testlib/cli-datadir/user/libraries/ESP32-Chimera-Core/src/ESP32-Chimera-Core.h:5:0, from /tmp/arduino-testlib794169876/test/test.ino:1: /home/ec2-user/arduino-testlib/cli-datadir/user/libraries/ESP32-Chimera-Core/src/ESP32-Chimera-Core.hpp:7:4: error: #error “This library only supports boards with ESP32 family processors” #error “This library only supports boards with ESP32 family processors” ^~~~~ In file included from /home/ec2-user/arduino-testlib/cli-datadir/user/libraries/ESP32-Chimera-Core/src/ESP32-Chimera-Core.h:5:0, from /tmp/arduino-testlib794169876/test/test.ino:1: /home/ec2-user/arduino-testlib/cli-datadir/user/libraries/ESP32-Chimera-Core/src/ESP32-Chimera-Core.hpp:16:10: fatal error: FS.h: No such file or directory #include <FS.h> ^~~~~~ compilation terminated.
Result: FAIL
Result: FAIL
Result: FAIL
In file included from /home/ec2-user/arduino-testlib/cli-datadir/user/libraries/ESP32-Chimera-Core/src/ESP32-Chimera-Core.h:5:0, from /tmp/arduino-testlib794169876/test/test.ino:1: /home/ec2-user/arduino-testlib/cli-datadir/user/libraries/ESP32-Chimera-Core/src/ESP32-Chimera-Core.hpp:7:4: error: #error “This library only supports boards with ESP32 family processors” #error “This library only supports boards with ESP32 family processors” ^~~~~ In file included from /home/ec2-user/arduino-testlib/cli-datadir/user/libraries/ESP32-Chimera-Core/src/ESP32-Chimera-Core.h:5:0, from /tmp/arduino-testlib794169876/test/test.ino:1: /home/ec2-user/arduino-testlib/cli-datadir/user/libraries/ESP32-Chimera-Core/src/ESP32-Chimera-Core.hpp:16:10: fatal error: FS.h: No such file or directory #include <FS.h> ^~~~~~ compilation terminated.
Result: FAIL
Result: FAIL
Result: FAIL
In file included from /home/ec2-user/arduino-testlib/cli-datadir/user/libraries/ESP32-Chimera-Core/src/ESP32-Chimera-Core.h:5:0, from /tmp/arduino-testlib2292858031/test/test.ino:1: /home/ec2-user/arduino-testlib/cli-datadir/user/libraries/ESP32-Chimera-Core/src/ESP32-Chimera-Core.hpp:7:4: error: #error “This library only supports boards with ESP32 family processors” #error “This library only supports boards with ESP32 family processors” ^~~~~ In file included from /home/ec2-user/arduino-testlib/cli-datadir/user/libraries/ESP32-Chimera-Core/src/ESP32-Chimera-Core.h:5:0, from /tmp/arduino-testlib2292858031/test/test.ino:1: /home/ec2-user/arduino-testlib/cli-datadir/user/libraries/ESP32-Chimera-Core/src/ESP32-Chimera-Core.hpp:16:10: fatal error: FS.h: No such file or directory #include <FS.h> ^~~~~~ compilation terminated.
Result: FAIL
Result: FAIL
Result: FAIL
In file included from /home/ec2-user/arduino-testlib/cli-datadir/user/libraries/SD/src/utility/Sd2Card.h:26:0, from /home/ec2-user/arduino-testlib/cli-datadir/user/libraries/SD/src/utility/SdFat.h:29, from /home/ec2-user/arduino-testlib/cli-datadir/user/libraries/SD/src/SD.h:20, from /home/ec2-user/arduino-testlib/cli-datadir/user/libraries/ESP32-Chimera-Core/src/ESP32-Chimera-Core.hpp:24, from /home/ec2-user/arduino-testlib/cli-datadir/user/libraries/ESP32-Chimera-Core/src/ESP32-Chimera-Core.h:5, from /tmp/arduino-testlib786613960/test/test.ino:1: /home/ec2-user/arduino-testlib/cli-datadir/user/libraries/SD/src/utility/Sd2PinMap.h:524:2: error: #error Architecture or board not supported. #error Architecture or board not supported. ^ Multiple libraries were found for "SD.h" Used: /home/ec2-user/arduino-testlib/cli-datadir/user/libraries/SD Not used: /home/ec2-user/arduino-testlib/cli-datadir/data/packages/esp32/hardware/esp32/1.0.6/libraries/SD
Result: FAIL
Result: FAIL