This report was generated on Wednesday, 23-Feb-22 22:48:15 CET using arduino-testlib.
Version: 0.1.2
More details
Board | Claims compatibility | Inclusion | ESP32AnalogReadTest |
---|---|---|---|
arduino:avr:uno
1.8.4 |
No | FAIL | FAIL |
arduino:mbed_nano:nanorp2040connect
2.7.2 |
No | FAIL | FAIL |
arduino:megaavr:nona4809
1.8.7 |
No | FAIL | FAIL |
arduino:samd:mkrwifi1010
1.8.12 |
No | FAIL | FAIL |
esp32:esp32:d1_mini32
1.0.6 |
Yes | PASS | PASS |
Result: FAIL
In file included from /tmp/arduino-testlib2812639479/test/test.ino:1:0: /home/ec2-user/arduino-testlib/cli-datadir/user/libraries/ESP32AnalogRead/ESP32AnalogRead.h:3:10: fatal error: esp_adc_cal.h: No such file or directory #include "esp_adc_cal.h" ^~~~~~~~~~~~~~~ compilation terminated.
Result: FAIL
In file included from /home/ec2-user/arduino-testlib/cli-datadir/user/libraries/ESP32AnalogRead/examples/ESP32AnalogReadTest/ESP32AnalogReadTest.ino:2:0: /home/ec2-user/arduino-testlib/cli-datadir/user/libraries/ESP32AnalogRead/ESP32AnalogRead.h:3:10: fatal error: esp_adc_cal.h: No such file or directory #include "esp_adc_cal.h" ^~~~~~~~~~~~~~~ compilation terminated.
Result: FAIL
In file included from /tmp/arduino-testlib819177277/test/test.ino:1:0: /home/ec2-user/arduino-testlib/cli-datadir/user/libraries/ESP32AnalogRead/ESP32AnalogRead.h:3:10: fatal error: esp_adc_cal.h: No such file or directory #include "esp_adc_cal.h" ^~~~~~~~~~~~~~~ compilation terminated.
Result: FAIL
In file included from /home/ec2-user/arduino-testlib/cli-datadir/user/libraries/ESP32AnalogRead/examples/ESP32AnalogReadTest/ESP32AnalogReadTest.ino:2:0: /home/ec2-user/arduino-testlib/cli-datadir/user/libraries/ESP32AnalogRead/ESP32AnalogRead.h:3:10: fatal error: esp_adc_cal.h: No such file or directory #include "esp_adc_cal.h" ^~~~~~~~~~~~~~~ compilation terminated.
Result: FAIL
In file included from /tmp/arduino-testlib819177277/test/test.ino:1:0: /home/ec2-user/arduino-testlib/cli-datadir/user/libraries/ESP32AnalogRead/ESP32AnalogRead.h:3:10: fatal error: esp_adc_cal.h: No such file or directory #include "esp_adc_cal.h" ^~~~~~~~~~~~~~~ compilation terminated.
Result: FAIL
In file included from /home/ec2-user/arduino-testlib/cli-datadir/user/libraries/ESP32AnalogRead/examples/ESP32AnalogReadTest/ESP32AnalogReadTest.ino:2:0: /home/ec2-user/arduino-testlib/cli-datadir/user/libraries/ESP32AnalogRead/ESP32AnalogRead.h:3:10: fatal error: esp_adc_cal.h: No such file or directory #include "esp_adc_cal.h" ^~~~~~~~~~~~~~~ compilation terminated.
Result: FAIL
In file included from /tmp/arduino-testlib2812639479/test/test.ino:1:0: /home/ec2-user/arduino-testlib/cli-datadir/user/libraries/ESP32AnalogRead/ESP32AnalogRead.h:3:10: fatal error: esp_adc_cal.h: No such file or directory #include "esp_adc_cal.h" ^~~~~~~~~~~~~~~ compilation terminated.
Result: FAIL
In file included from /home/ec2-user/arduino-testlib/cli-datadir/user/libraries/ESP32AnalogRead/examples/ESP32AnalogReadTest/ESP32AnalogReadTest.ino:2:0: /home/ec2-user/arduino-testlib/cli-datadir/user/libraries/ESP32AnalogRead/ESP32AnalogRead.h:3:10: fatal error: esp_adc_cal.h: No such file or directory #include "esp_adc_cal.h" ^~~~~~~~~~~~~~~ compilation terminated.
Result: PASS
Sketch uses 198000 bytes (15%) of program storage space. Maximum is 1310720 bytes. Global variables use 13104 bytes (3%) of dynamic memory, leaving 314576 bytes for local variables. Maximum is 327680 bytes.
Result: PASS
Sketch uses 222982 bytes (17%) of program storage space. Maximum is 1310720 bytes. Global variables use 13504 bytes (4%) of dynamic memory, leaving 314176 bytes for local variables. Maximum is 327680 bytes.