This report was generated on Wednesday, 23-Feb-22 22:48:15 CET using arduino-testlib.
Version: 1.2.0
More details
Board | Claims compatibility | Inclusion | FS_Counting |
FS_Test |
---|---|---|---|---|
arduino:avr:uno
1.8.4 |
No | FAIL | FAIL | FAIL |
arduino:mbed_nano:nanorp2040connect
2.7.2 |
Yes ⚠️ | FAIL | FAIL | FAIL |
arduino:megaavr:nona4809
1.8.7 |
No | FAIL | FAIL | FAIL |
arduino:samd:mkrwifi1010
1.8.12 |
No | FAIL | FAIL | FAIL |
esp32:esp32:d1_mini32
1.0.6 |
No | FAIL | FAIL | FAIL |
Result: FAIL
In file included from /tmp/arduino-testlib2801235327/test/test.ino:1:0: /home/ec2-user/arduino-testlib/cli-datadir/user/libraries/FS_Nano33BLE/src/FS_Nano33BLE.h:23:4: error: #error This code is intended to run on the MBED nRF52840 platform! Please check your Tools->Board setting. #error This code is intended to run on the MBED nRF52840 platform! Please check your Tools->Board setting. ^~~~~ In file included from /tmp/arduino-testlib2801235327/test/test.ino:1:0: /home/ec2-user/arduino-testlib/cli-datadir/user/libraries/FS_Nano33BLE/src/FS_Nano33BLE.h:93:12: fatal error: FlashIAPBlockDevice.h: No such file or directory #include "FlashIAPBlockDevice.h" ^~~~~~~~~~~~~~~~~~~~~~~ compilation terminated.
Result: FAIL
In file included from /home/ec2-user/arduino-testlib/cli-datadir/user/libraries/FS_Nano33BLE/examples/FS_Counting/FS_Counting.ino:26:0: /home/ec2-user/arduino-testlib/cli-datadir/user/libraries/FS_Nano33BLE/src/FS_Nano33BLE.h:23:4: error: #error This code is intended to run on the MBED nRF52840 platform! Please check your Tools->Board setting. #error This code is intended to run on the MBED nRF52840 platform! Please check your Tools->Board setting. ^~~~~ In file included from /home/ec2-user/arduino-testlib/cli-datadir/user/libraries/FS_Nano33BLE/examples/FS_Counting/FS_Counting.ino:26:0: /home/ec2-user/arduino-testlib/cli-datadir/user/libraries/FS_Nano33BLE/src/FS_Nano33BLE.h:93:12: fatal error: FlashIAPBlockDevice.h: No such file or directory #include "FlashIAPBlockDevice.h" ^~~~~~~~~~~~~~~~~~~~~~~ compilation terminated.
Result: FAIL
In file included from /home/ec2-user/arduino-testlib/cli-datadir/user/libraries/FS_Nano33BLE/examples/FS_Test/FS_Test.ino:26:0: /home/ec2-user/arduino-testlib/cli-datadir/user/libraries/FS_Nano33BLE/src/FS_Nano33BLE.h:23:4: error: #error This code is intended to run on the MBED nRF52840 platform! Please check your Tools->Board setting. #error This code is intended to run on the MBED nRF52840 platform! Please check your Tools->Board setting. ^~~~~ In file included from /home/ec2-user/arduino-testlib/cli-datadir/user/libraries/FS_Nano33BLE/examples/FS_Test/FS_Test.ino:26:0: /home/ec2-user/arduino-testlib/cli-datadir/user/libraries/FS_Nano33BLE/src/FS_Nano33BLE.h:93:12: fatal error: FlashIAPBlockDevice.h: No such file or directory #include "FlashIAPBlockDevice.h" ^~~~~~~~~~~~~~~~~~~~~~~ compilation terminated.
Result: FAIL
In file included from /tmp/arduino-testlib3894603341/test/test.ino:1:0: /home/ec2-user/arduino-testlib/cli-datadir/user/libraries/FS_Nano33BLE/src/FS_Nano33BLE.h:23:4: error: #error This code is intended to run on the MBED nRF52840 platform! Please check your Tools->Board setting. #error This code is intended to run on the MBED nRF52840 platform! Please check your Tools->Board setting. ^~~~~
Result: FAIL
In file included from /home/ec2-user/arduino-testlib/cli-datadir/user/libraries/FS_Nano33BLE/examples/FS_Counting/FS_Counting.ino:26:0: /home/ec2-user/arduino-testlib/cli-datadir/user/libraries/FS_Nano33BLE/src/FS_Nano33BLE.h:23:4: error: #error This code is intended to run on the MBED nRF52840 platform! Please check your Tools->Board setting. #error This code is intended to run on the MBED nRF52840 platform! Please check your Tools->Board setting. ^~~~~
Result: FAIL
In file included from /home/ec2-user/arduino-testlib/cli-datadir/user/libraries/FS_Nano33BLE/examples/FS_Test/FS_Test.ino:26:0: /home/ec2-user/arduino-testlib/cli-datadir/user/libraries/FS_Nano33BLE/src/FS_Nano33BLE.h:23:4: error: #error This code is intended to run on the MBED nRF52840 platform! Please check your Tools->Board setting. #error This code is intended to run on the MBED nRF52840 platform! Please check your Tools->Board setting. ^~~~~
Result: FAIL
In file included from /tmp/arduino-testlib3894603341/test/test.ino:1:0: /home/ec2-user/arduino-testlib/cli-datadir/user/libraries/FS_Nano33BLE/src/FS_Nano33BLE.h:23:4: error: #error This code is intended to run on the MBED nRF52840 platform! Please check your Tools->Board setting. #error This code is intended to run on the MBED nRF52840 platform! Please check your Tools->Board setting. ^~~~~ In file included from /tmp/arduino-testlib3894603341/test/test.ino:1:0: /home/ec2-user/arduino-testlib/cli-datadir/user/libraries/FS_Nano33BLE/src/FS_Nano33BLE.h:93:12: fatal error: FlashIAPBlockDevice.h: No such file or directory #include "FlashIAPBlockDevice.h" ^~~~~~~~~~~~~~~~~~~~~~~ compilation terminated.
Result: FAIL
In file included from /home/ec2-user/arduino-testlib/cli-datadir/user/libraries/FS_Nano33BLE/examples/FS_Counting/FS_Counting.ino:26:0: /home/ec2-user/arduino-testlib/cli-datadir/user/libraries/FS_Nano33BLE/src/FS_Nano33BLE.h:23:4: error: #error This code is intended to run on the MBED nRF52840 platform! Please check your Tools->Board setting. #error This code is intended to run on the MBED nRF52840 platform! Please check your Tools->Board setting. ^~~~~ In file included from /home/ec2-user/arduino-testlib/cli-datadir/user/libraries/FS_Nano33BLE/examples/FS_Counting/FS_Counting.ino:26:0: /home/ec2-user/arduino-testlib/cli-datadir/user/libraries/FS_Nano33BLE/src/FS_Nano33BLE.h:93:12: fatal error: FlashIAPBlockDevice.h: No such file or directory #include "FlashIAPBlockDevice.h" ^~~~~~~~~~~~~~~~~~~~~~~ compilation terminated.
Result: FAIL
In file included from /home/ec2-user/arduino-testlib/cli-datadir/user/libraries/FS_Nano33BLE/examples/FS_Test/FS_Test.ino:26:0: /home/ec2-user/arduino-testlib/cli-datadir/user/libraries/FS_Nano33BLE/src/FS_Nano33BLE.h:23:4: error: #error This code is intended to run on the MBED nRF52840 platform! Please check your Tools->Board setting. #error This code is intended to run on the MBED nRF52840 platform! Please check your Tools->Board setting. ^~~~~ In file included from /home/ec2-user/arduino-testlib/cli-datadir/user/libraries/FS_Nano33BLE/examples/FS_Test/FS_Test.ino:26:0: /home/ec2-user/arduino-testlib/cli-datadir/user/libraries/FS_Nano33BLE/src/FS_Nano33BLE.h:93:12: fatal error: FlashIAPBlockDevice.h: No such file or directory #include "FlashIAPBlockDevice.h" ^~~~~~~~~~~~~~~~~~~~~~~ compilation terminated.
Result: FAIL
In file included from /tmp/arduino-testlib2801235327/test/test.ino:1:0: /home/ec2-user/arduino-testlib/cli-datadir/user/libraries/FS_Nano33BLE/src/FS_Nano33BLE.h:23:4: error: #error This code is intended to run on the MBED nRF52840 platform! Please check your Tools->Board setting. #error This code is intended to run on the MBED nRF52840 platform! Please check your Tools->Board setting. ^~~~~ In file included from /tmp/arduino-testlib2801235327/test/test.ino:1:0: /home/ec2-user/arduino-testlib/cli-datadir/user/libraries/FS_Nano33BLE/src/FS_Nano33BLE.h:93:12: fatal error: FlashIAPBlockDevice.h: No such file or directory #include "FlashIAPBlockDevice.h" ^~~~~~~~~~~~~~~~~~~~~~~ compilation terminated.
Result: FAIL
In file included from /home/ec2-user/arduino-testlib/cli-datadir/user/libraries/FS_Nano33BLE/examples/FS_Counting/FS_Counting.ino:26:0: /home/ec2-user/arduino-testlib/cli-datadir/user/libraries/FS_Nano33BLE/src/FS_Nano33BLE.h:23:4: error: #error This code is intended to run on the MBED nRF52840 platform! Please check your Tools->Board setting. #error This code is intended to run on the MBED nRF52840 platform! Please check your Tools->Board setting. ^~~~~ In file included from /home/ec2-user/arduino-testlib/cli-datadir/user/libraries/FS_Nano33BLE/examples/FS_Counting/FS_Counting.ino:26:0: /home/ec2-user/arduino-testlib/cli-datadir/user/libraries/FS_Nano33BLE/src/FS_Nano33BLE.h:93:12: fatal error: FlashIAPBlockDevice.h: No such file or directory #include "FlashIAPBlockDevice.h" ^~~~~~~~~~~~~~~~~~~~~~~ compilation terminated.
Result: FAIL
In file included from /home/ec2-user/arduino-testlib/cli-datadir/user/libraries/FS_Nano33BLE/examples/FS_Test/FS_Test.ino:26:0: /home/ec2-user/arduino-testlib/cli-datadir/user/libraries/FS_Nano33BLE/src/FS_Nano33BLE.h:23:4: error: #error This code is intended to run on the MBED nRF52840 platform! Please check your Tools->Board setting. #error This code is intended to run on the MBED nRF52840 platform! Please check your Tools->Board setting. ^~~~~ In file included from /home/ec2-user/arduino-testlib/cli-datadir/user/libraries/FS_Nano33BLE/examples/FS_Test/FS_Test.ino:26:0: /home/ec2-user/arduino-testlib/cli-datadir/user/libraries/FS_Nano33BLE/src/FS_Nano33BLE.h:93:12: fatal error: FlashIAPBlockDevice.h: No such file or directory #include "FlashIAPBlockDevice.h" ^~~~~~~~~~~~~~~~~~~~~~~ compilation terminated.
Result: FAIL
In file included from /tmp/arduino-testlib3894603341/test/test.ino:1:0: /home/ec2-user/arduino-testlib/cli-datadir/user/libraries/FS_Nano33BLE/src/FS_Nano33BLE.h:23:4: error: #error This code is intended to run on the MBED nRF52840 platform! Please check your Tools->Board setting. #error This code is intended to run on the MBED nRF52840 platform! Please check your Tools->Board setting. ^ In file included from /tmp/arduino-testlib3894603341/test/test.ino:1:0: /home/ec2-user/arduino-testlib/cli-datadir/user/libraries/FS_Nano33BLE/src/FS_Nano33BLE.h:93:35: fatal error: FlashIAPBlockDevice.h: No such file or directory compilation terminated.
Result: FAIL
In file included from /home/ec2-user/arduino-testlib/cli-datadir/user/libraries/FS_Nano33BLE/examples/FS_Counting/FS_Counting.ino:26:0: /home/ec2-user/arduino-testlib/cli-datadir/user/libraries/FS_Nano33BLE/src/FS_Nano33BLE.h:23:4: error: #error This code is intended to run on the MBED nRF52840 platform! Please check your Tools->Board setting. #error This code is intended to run on the MBED nRF52840 platform! Please check your Tools->Board setting. ^ In file included from /home/ec2-user/arduino-testlib/cli-datadir/user/libraries/FS_Nano33BLE/examples/FS_Counting/FS_Counting.ino:26:0: /home/ec2-user/arduino-testlib/cli-datadir/user/libraries/FS_Nano33BLE/src/FS_Nano33BLE.h:93:35: fatal error: FlashIAPBlockDevice.h: No such file or directory compilation terminated.
Result: FAIL
In file included from /home/ec2-user/arduino-testlib/cli-datadir/user/libraries/FS_Nano33BLE/examples/FS_Test/FS_Test.ino:26:0: /home/ec2-user/arduino-testlib/cli-datadir/user/libraries/FS_Nano33BLE/src/FS_Nano33BLE.h:23:4: error: #error This code is intended to run on the MBED nRF52840 platform! Please check your Tools->Board setting. #error This code is intended to run on the MBED nRF52840 platform! Please check your Tools->Board setting. ^ In file included from /home/ec2-user/arduino-testlib/cli-datadir/user/libraries/FS_Nano33BLE/examples/FS_Test/FS_Test.ino:26:0: /home/ec2-user/arduino-testlib/cli-datadir/user/libraries/FS_Nano33BLE/src/FS_Nano33BLE.h:93:35: fatal error: FlashIAPBlockDevice.h: No such file or directory compilation terminated.