ISFET board library - compatibility matrix

This report was generated on Wednesday, 23-Feb-22 22:48:15 CET using arduino-testlib.

ISFET board library

Version: 0.1.2
More details

Compatibility matrix

Board Claims compatibility Inclusion
IsfetBoard_librarytester
arduino:avr:uno
1.8.4
Yes ⚠️ FAIL PASS
arduino:mbed_nano:nanorp2040connect
2.7.2
Yes ⚠️ FAIL FAIL
arduino:megaavr:nona4809
1.8.7
Yes ⚠️ FAIL PASS
arduino:samd:mkrwifi1010
1.8.12
Yes ⚠️ FAIL FAIL
esp32:esp32:d1_mini32
1.0.6
Yes ⚠️ FAIL FAIL

Compilation logs

arduino:avr:uno @ 1.8.4

Inclusion

Result: FAIL
This library has no main header file so an empty one was created.

/private/tmp/arduino-testlib1488237262/test/test.ino:1:10: fatal error: ISFET_board_library.h: No such file or directory
 #include <ISFET_board_library.h>
          ^~~~~~~~~~~~~~~~~~~~~~~
compilation terminated.

examples/IsfetBoard_librarytester

Result: PASS

Sketch uses 7820 bytes (24%) of program storage space. Maximum is 32256 bytes.
Global variables use 448 bytes (21%) of dynamic memory, leaving 1600 bytes for local variables. Maximum is 2048 bytes.

arduino:mbed_nano:nanorp2040connect @ 2.7.2

Inclusion

Result: FAIL
This library has no main header file so an empty one was created.

/tmp/arduino-testlib2984650747/test/test.ino:1:10: fatal error: ISFET_board_library.h: No such file or directory
 #include <ISFET_board_library.h>
          ^~~~~~~~~~~~~~~~~~~~~~~
compilation terminated.

examples/IsfetBoard_librarytester

Result: FAIL

/home/ec2-user/arduino-testlib/cli-datadir/user/libraries/Dabble/src/SoftwareSerial.cpp:45:10: fatal error: util/delay_basic.h: No such file or directory
 #include <util/delay_basic.h>
          ^~~~~~~~~~~~~~~~~~~~
compilation terminated.
Multiple libraries were found for "SoftwareSerial.h"
  Used: /home/ec2-user/arduino-testlib/cli-datadir/user/libraries/Dabble
  Not used: /home/ec2-user/arduino-testlib/cli-datadir/user/libraries/Printoo_Library
  Not used: /home/ec2-user/arduino-testlib/cli-datadir/user/libraries/EspSoftwareSerial

arduino:megaavr:nona4809 @ 1.8.7

Inclusion

Result: FAIL
This library has no main header file so an empty one was created.

/tmp/arduino-testlib2984650747/test/test.ino:1:10: fatal error: ISFET_board_library.h: No such file or directory
 #include <ISFET_board_library.h>
          ^~~~~~~~~~~~~~~~~~~~~~~
compilation terminated.

examples/IsfetBoard_librarytester

Result: PASS

Sketch uses 8661 bytes (17%) of program storage space. Maximum is 49152 bytes.
Global variables use 551 bytes (8%) of dynamic memory, leaving 5593 bytes for local variables. Maximum is 6144 bytes.

arduino:samd:mkrwifi1010 @ 1.8.12

Inclusion

Result: FAIL
This library has no main header file so an empty one was created.

/private/tmp/arduino-testlib1488237262/test/test.ino:1:10: fatal error: ISFET_board_library.h: No such file or directory
 #include <ISFET_board_library.h>
          ^~~~~~~~~~~~~~~~~~~~~~~
compilation terminated.

examples/IsfetBoard_librarytester

Result: FAIL

/Users/alranel/Documents/git/arduino/arduino-testlib/cli-datadir/user/libraries/Dabble/src/SoftwareSerial.cpp:45:10: fatal error: util/delay_basic.h: No such file or directory
 #include <util/delay_basic.h>
          ^~~~~~~~~~~~~~~~~~~~
compilation terminated.
Multiple libraries were found for "SoftwareSerial.h"
  Used: /Users/alranel/Documents/git/arduino/arduino-testlib/cli-datadir/user/libraries/Dabble
  Not used: /Users/alranel/Documents/git/arduino/arduino-testlib/cli-datadir/user/libraries/EspSoftwareSerial
  Not used: /Users/alranel/Documents/git/arduino/arduino-testlib/cli-datadir/user/libraries/Printoo_Library

esp32:esp32:d1_mini32 @ 1.0.6

Inclusion

Result: FAIL
This library has no main header file so an empty one was created.

/tmp/arduino-testlib2486452483/test/test.ino:1:33: fatal error: ISFET_board_library.h: No such file or directory
compilation terminated.

examples/IsfetBoard_librarytester

Result: FAIL

/home/ec2-user/arduino-testlib/cli-datadir/user/libraries/ISFET_board_library/isfetboard.cpp:24:71: error: default argument given for parameter 3 of 'IsfetBoard::IsfetBoard(uint8_t, uint8_t, int)' [-fpermissive]
 IsfetBoard::IsfetBoard(uint8_t pintx, uint8_t pinrx, int baudrate=9600) :
                                                                       ^
In file included from /home/ec2-user/arduino-testlib/cli-datadir/user/libraries/ISFET_board_library/isfetboard.cpp:20:0:
/home/ec2-user/arduino-testlib/cli-datadir/user/libraries/ISFET_board_library/isfetboard.h:35:3: note: previous specification in 'IsfetBoard::IsfetBoard(uint8_t, uint8_t, int)' here
   IsfetBoard(uint8_t pintx, uint8_t pinrx, int baudrate=9600);
   ^
Multiple libraries were found for "SoftwareSerial.h"
  Used: /home/ec2-user/arduino-testlib/cli-datadir/user/libraries/EspSoftwareSerial
  Not used: /home/ec2-user/arduino-testlib/cli-datadir/user/libraries/Dabble
  Not used: /home/ec2-user/arduino-testlib/cli-datadir/user/libraries/Printoo_Library