This report was generated on Wednesday, 23-Feb-22 22:48:15 CET using arduino-testlib.
Version: 0.1.0
More details
Board | Claims compatibility | Inclusion | NovaSDS011 |
---|---|---|---|
arduino:avr:uno
1.8.4 |
Yes | PASS | PASS |
arduino:mbed_nano:nanorp2040connect
2.7.2 |
No | FAIL | FAIL |
arduino:megaavr:nona4809
1.8.7 |
No ⚠️ | PASS | PASS |
arduino:samd:mkrwifi1010
1.8.12 |
No | FAIL | FAIL |
esp32:esp32:d1_mini32
1.0.6 |
No | FAIL | FAIL |
Result: PASS
This library has no main header file so an empty one was created.
Sketch uses 464 bytes (1%) of program storage space. Maximum is 32256 bytes. Global variables use 11 bytes (0%) of dynamic memory, leaving 2037 bytes for local variables. Maximum is 2048 bytes.
Result: PASS
Sketch uses 9408 bytes (29%) of program storage space. Maximum is 32256 bytes. Global variables use 649 bytes (31%) of dynamic memory, leaving 1399 bytes for local variables. Maximum is 2048 bytes.
Result: FAIL
/home/ec2-user/arduino-testlib/cli-datadir/user/libraries/Dabble/src/SoftwareSerial.cpp:45:10: fatal error: util/delay_basic.h: No such file or directory #include <util/delay_basic.h> ^~~~~~~~~~~~~~~~~~~~ compilation terminated. Multiple libraries were found for "SoftwareSerial.h" Used: /home/ec2-user/arduino-testlib/cli-datadir/user/libraries/Dabble Not used: /home/ec2-user/arduino-testlib/cli-datadir/user/libraries/EspSoftwareSerial Not used: /home/ec2-user/arduino-testlib/cli-datadir/user/libraries/Printoo_Library
Result: FAIL
/home/ec2-user/arduino-testlib/cli-datadir/user/libraries/Dabble/src/SoftwareSerial.cpp:45:10: fatal error: util/delay_basic.h: No such file or directory #include <util/delay_basic.h> ^~~~~~~~~~~~~~~~~~~~ compilation terminated. Multiple libraries were found for "SoftwareSerial.h" Used: /home/ec2-user/arduino-testlib/cli-datadir/user/libraries/Dabble Not used: /home/ec2-user/arduino-testlib/cli-datadir/user/libraries/Printoo_Library Not used: /home/ec2-user/arduino-testlib/cli-datadir/user/libraries/EspSoftwareSerial
Result: PASS
WARNING: library Nova_SDS011_Sensor_Library claims to run on esp8266, avr architecture(s) and may be incompatible with your current board which runs on megaavr architecture(s). Sketch uses 1354 bytes (2%) of program storage space. Maximum is 49152 bytes. Global variables use 120 bytes (1%) of dynamic memory, leaving 6024 bytes for local variables. Maximum is 6144 bytes.
Result: PASS
WARNING: library Nova_SDS011_Sensor_Library claims to run on esp8266, avr architecture(s) and may be incompatible with your current board which runs on megaavr architecture(s). Sketch uses 10597 bytes (21%) of program storage space. Maximum is 49152 bytes. Global variables use 580 bytes (9%) of dynamic memory, leaving 5564 bytes for local variables. Maximum is 6144 bytes.
Result: FAIL
This library has no main header file so an empty one was created.
/home/ec2-user/arduino-testlib/cli-datadir/user/libraries/Dabble/src/SoftwareSerial.cpp:45:10: fatal error: util/delay_basic.h: No such file or directory #include <util/delay_basic.h> ^~~~~~~~~~~~~~~~~~~~ compilation terminated. Multiple libraries were found for "SoftwareSerial.h" Used: /home/ec2-user/arduino-testlib/cli-datadir/user/libraries/Dabble Not used: /home/ec2-user/arduino-testlib/cli-datadir/user/libraries/EspSoftwareSerial Not used: /home/ec2-user/arduino-testlib/cli-datadir/user/libraries/Printoo_Library
Result: FAIL
/home/ec2-user/arduino-testlib/cli-datadir/user/libraries/Dabble/src/SoftwareSerial.cpp:45:10: fatal error: util/delay_basic.h: No such file or directory #include <util/delay_basic.h> ^~~~~~~~~~~~~~~~~~~~ compilation terminated. Multiple libraries were found for "SoftwareSerial.h" Used: /home/ec2-user/arduino-testlib/cli-datadir/user/libraries/Dabble Not used: /home/ec2-user/arduino-testlib/cli-datadir/user/libraries/Printoo_Library Not used: /home/ec2-user/arduino-testlib/cli-datadir/user/libraries/EspSoftwareSerial
Result: FAIL
WARNING: library Nova_SDS011_Sensor_Library claims to run on esp8266, avr architecture(s) and may be incompatible with your current board which runs on esp32 architecture(s). In file included from /home/ec2-user/arduino-testlib/cli-datadir/user/libraries/Nova_SDS011_Sensor_Library/src/NovaSDS011.cpp:12:0: /home/ec2-user/arduino-testlib/cli-datadir/user/libraries/Nova_SDS011_Sensor_Library/src/NovaSDS011.h:44:10: error: 'sleep' redeclared as different kind of symbol sleep = 0, ^ In file included from /home/ec2-user/arduino-testlib/cli-datadir/data/packages/esp32/hardware/esp32/1.0.6/tools/sdk/include/newlib/stdio.h:29:0, from /home/ec2-user/arduino-testlib/cli-datadir/data/packages/esp32/hardware/esp32/1.0.6/cores/esp32/Arduino.h:27, from /home/ec2-user/arduino-testlib/cli-datadir/user/libraries/Nova_SDS011_Sensor_Library/src/NovaSDS011.h:15, from /home/ec2-user/arduino-testlib/cli-datadir/user/libraries/Nova_SDS011_Sensor_Library/src/NovaSDS011.cpp:12: /home/ec2-user/arduino-testlib/cli-datadir/data/packages/esp32/hardware/esp32/1.0.6/tools/sdk/include/newlib/sys/unistd.h:185:10: note: previous declaration 'unsigned int sleep(unsigned int)' unsigned _EXFUN(sleep, (unsigned int __seconds )); ^ Multiple libraries were found for "SoftwareSerial.h" Used: /home/ec2-user/arduino-testlib/cli-datadir/user/libraries/EspSoftwareSerial Not used: /home/ec2-user/arduino-testlib/cli-datadir/user/libraries/Printoo_Library Not used: /home/ec2-user/arduino-testlib/cli-datadir/user/libraries/Dabble
Result: FAIL
WARNING: library Nova_SDS011_Sensor_Library claims to run on esp8266, avr architecture(s) and may be incompatible with your current board which runs on esp32 architecture(s). In file included from /home/ec2-user/arduino-testlib/cli-datadir/user/libraries/Nova_SDS011_Sensor_Library/examples/NovaSDS011/NovaSDS011.ino:1:0: /home/ec2-user/arduino-testlib/cli-datadir/user/libraries/Nova_SDS011_Sensor_Library/src/NovaSDS011.h:44:10: error: 'sleep' redeclared as different kind of symbol sleep = 0, ^ In file included from /home/ec2-user/arduino-testlib/cli-datadir/data/packages/esp32/hardware/esp32/1.0.6/tools/sdk/include/newlib/stdio.h:29:0, from /home/ec2-user/arduino-testlib/cli-datadir/data/packages/esp32/hardware/esp32/1.0.6/cores/esp32/Arduino.h:27, from /tmp/arduino-sketch-4F76D41FF4CFD9E4D2B1B5E6BC7C902B/sketch/NovaSDS011.ino.cpp:1: /home/ec2-user/arduino-testlib/cli-datadir/data/packages/esp32/hardware/esp32/1.0.6/tools/sdk/include/newlib/sys/unistd.h:185:10: note: previous declaration 'unsigned int sleep(unsigned int)' unsigned _EXFUN(sleep, (unsigned int __seconds )); ^ Multiple libraries were found for "SoftwareSerial.h" Used: /home/ec2-user/arduino-testlib/cli-datadir/user/libraries/EspSoftwareSerial Not used: /home/ec2-user/arduino-testlib/cli-datadir/user/libraries/Printoo_Library Not used: /home/ec2-user/arduino-testlib/cli-datadir/user/libraries/Dabble