Picovoice_DE - compatibility matrix

This report was generated on Wednesday, 23-Feb-22 22:48:15 CET using arduino-testlib.

Picovoice_DE

Version: 2.1.0
More details

Compatibility matrix

Board Claims compatibility Inclusion
GetUUID
PicovoiceExample
arduino:avr:uno
1.8.4
No FAIL FAIL FAIL
arduino:mbed_nano:nanorp2040connect
2.7.2
Yes ⚠️ FAIL FAIL FAIL
arduino:megaavr:nona4809
1.8.7
No FAIL FAIL FAIL
arduino:samd:mkrwifi1010
1.8.12
No FAIL FAIL FAIL
esp32:esp32:d1_mini32
1.0.6
No FAIL FAIL FAIL

Compilation logs

arduino:avr:uno @ 1.8.4

Inclusion

Result: FAIL

/Users/alranel/Documents/git/arduino/arduino-testlib/cli-datadir/user/libraries/Picovoice_DE/src/utility/pv_audio_rec.cpp:15:10: fatal error: PDM.h: No such file or directory
 #include "PDM.h"
          ^~~~~~~
compilation terminated.

examples/GetUUID

Result: FAIL

/Users/alranel/Documents/git/arduino/arduino-testlib/cli-datadir/user/libraries/Picovoice_DE/src/utility/pv_audio_rec.cpp:15:10: fatal error: PDM.h: No such file or directory
 #include "PDM.h"
          ^~~~~~~
compilation terminated.

examples/PicovoiceExample

Result: FAIL

/Users/alranel/Documents/git/arduino/arduino-testlib/cli-datadir/user/libraries/Picovoice_DE/src/utility/pv_audio_rec.cpp:15:10: fatal error: PDM.h: No such file or directory
 #include "PDM.h"
          ^~~~~~~
compilation terminated.

arduino:mbed_nano:nanorp2040connect @ 2.7.2

Inclusion

Result: FAIL

Library Picovoice_DE has been declared precompiled:
Precompiled library in "/home/ec2-user/arduino-testlib/cli-datadir/user/libraries/Picovoice_DE/src/cortex-m0plus" not found
/home/ec2-user/arduino-testlib/cli-datadir/user/libraries/Picovoice_DE/src/Picovoice_DE.cpp:28:2: error: #error “Unsupported board.”
 #error “Unsupported board.”
  ^~~~~
/home/ec2-user/arduino-testlib/cli-datadir/user/libraries/Picovoice_DE/src/Picovoice_DE.cpp: In function 'const uint8_t* pv_get_uuid()':
/home/ec2-user/arduino-testlib/cli-datadir/user/libraries/Picovoice_DE/src/Picovoice_DE.cpp:33:30: error: 'UUID_ADDRESS' was not declared in this scope
     return (const uint8_t *) UUID_ADDRESS;
                              ^~~~~~~~~~~~
/home/ec2-user/arduino-testlib/cli-datadir/user/libraries/Picovoice_DE/src/Picovoice_DE.cpp: In function 'uint32_t pv_get_uuid_size()':
/home/ec2-user/arduino-testlib/cli-datadir/user/libraries/Picovoice_DE/src/Picovoice_DE.cpp:37:12: error: 'UUID_SIZE' was not declared in this scope
     return UUID_SIZE;
            ^~~~~~~~~
/home/ec2-user/arduino-testlib/cli-datadir/user/libraries/Picovoice_DE/src/Picovoice_DE.cpp:37:12: note: suggested alternative: '_T_SIZE'
     return UUID_SIZE;
            ^~~~~~~~~
            _T_SIZE

examples/GetUUID

Result: FAIL

Library Picovoice_DE has been declared precompiled:
Precompiled library in "/home/ec2-user/arduino-testlib/cli-datadir/user/libraries/Picovoice_DE/src/cortex-m0plus" not found
/home/ec2-user/arduino-testlib/cli-datadir/user/libraries/Picovoice_DE/src/Picovoice_DE.cpp:28:2: error: #error “Unsupported board.”
 #error “Unsupported board.”
  ^~~~~
/home/ec2-user/arduino-testlib/cli-datadir/user/libraries/Picovoice_DE/src/Picovoice_DE.cpp: In function 'const uint8_t* pv_get_uuid()':
/home/ec2-user/arduino-testlib/cli-datadir/user/libraries/Picovoice_DE/src/Picovoice_DE.cpp:33:30: error: 'UUID_ADDRESS' was not declared in this scope
     return (const uint8_t *) UUID_ADDRESS;
                              ^~~~~~~~~~~~
/home/ec2-user/arduino-testlib/cli-datadir/user/libraries/Picovoice_DE/src/Picovoice_DE.cpp: In function 'uint32_t pv_get_uuid_size()':
/home/ec2-user/arduino-testlib/cli-datadir/user/libraries/Picovoice_DE/src/Picovoice_DE.cpp:37:12: error: 'UUID_SIZE' was not declared in this scope
     return UUID_SIZE;
            ^~~~~~~~~
/home/ec2-user/arduino-testlib/cli-datadir/user/libraries/Picovoice_DE/src/Picovoice_DE.cpp:37:12: note: suggested alternative: '_T_SIZE'
     return UUID_SIZE;
            ^~~~~~~~~
            _T_SIZE

examples/PicovoiceExample

Result: FAIL

/home/ec2-user/arduino-testlib/cli-datadir/user/libraries/Picovoice_DE/examples/PicovoiceExample/PicovoiceExample.ino:18:33: error: expected primary-expression before '...' token
 static const char* ACCESS_KEY = ... //AccessKey string obtained from Picovoice Console (https://picovoice.ai/console/)
                                 ^~~
/home/ec2-user/arduino-testlib/cli-datadir/user/libraries/Picovoice_DE/examples/PicovoiceExample/PicovoiceExample.ino: In function 'void setup()':
/home/ec2-user/arduino-testlib/cli-datadir/user/libraries/Picovoice_DE/examples/PicovoiceExample/PicovoiceExample.ino:77:10: error: 'handle' was not declared in this scope
         &handle);
          ^~~~~~
/home/ec2-user/arduino-testlib/cli-datadir/user/libraries/Picovoice_DE/examples/PicovoiceExample/PicovoiceExample.ino:77:10: note: suggested alternative: 'random'
         &handle);
          ^~~~~~
          random
/home/ec2-user/arduino-testlib/cli-datadir/user/libraries/Picovoice_DE/examples/PicovoiceExample/PicovoiceExample.ino: In function 'void loop()':
/home/ec2-user/arduino-testlib/cli-datadir/user/libraries/Picovoice_DE/examples/PicovoiceExample/PicovoiceExample.ino:99:57: error: 'handle' was not declared in this scope
         const pv_status_t status = pv_picovoice_process(handle, buffer);
                                                         ^~~~~~
/home/ec2-user/arduino-testlib/cli-datadir/user/libraries/Picovoice_DE/examples/PicovoiceExample/PicovoiceExample.ino:99:57: note: suggested alternative: 'random'
         const pv_status_t status = pv_picovoice_process(handle, buffer);
                                                         ^~~~~~
                                                         random

arduino:megaavr:nona4809 @ 1.8.7

Inclusion

Result: FAIL

/home/ec2-user/arduino-testlib/cli-datadir/user/libraries/Picovoice_DE/src/utility/pv_audio_rec.cpp:15:10: fatal error: PDM.h: No such file or directory
 #include "PDM.h"
          ^~~~~~~
compilation terminated.

examples/GetUUID

Result: FAIL

/home/ec2-user/arduino-testlib/cli-datadir/user/libraries/Picovoice_DE/src/utility/pv_audio_rec.cpp:15:10: fatal error: PDM.h: No such file or directory
 #include "PDM.h"
          ^~~~~~~
compilation terminated.

examples/PicovoiceExample

Result: FAIL

/home/ec2-user/arduino-testlib/cli-datadir/user/libraries/Picovoice_DE/src/utility/pv_audio_rec.cpp:15:10: fatal error: PDM.h: No such file or directory
 #include "PDM.h"
          ^~~~~~~
compilation terminated.

arduino:samd:mkrwifi1010 @ 1.8.12

Inclusion

Result: FAIL

/Users/alranel/Documents/git/arduino/arduino-testlib/cli-datadir/user/libraries/Picovoice_DE/src/utility/pv_audio_rec.cpp:15:10: fatal error: PDM.h: No such file or directory
 #include "PDM.h"
          ^~~~~~~
compilation terminated.

examples/GetUUID

Result: FAIL

/Users/alranel/Documents/git/arduino/arduino-testlib/cli-datadir/user/libraries/Picovoice_DE/src/utility/pv_audio_rec.cpp:15:10: fatal error: PDM.h: No such file or directory
 #include "PDM.h"
          ^~~~~~~
compilation terminated.

examples/PicovoiceExample

Result: FAIL

/Users/alranel/Documents/git/arduino/arduino-testlib/cli-datadir/user/libraries/Picovoice_DE/src/utility/pv_audio_rec.cpp:15:10: fatal error: PDM.h: No such file or directory
 #include "PDM.h"
          ^~~~~~~
compilation terminated.

esp32:esp32:d1_mini32 @ 1.0.6

Inclusion

Result: FAIL

/home/ec2-user/arduino-testlib/cli-datadir/user/libraries/Picovoice_DE/src/utility/pv_audio_rec.cpp:15:17: fatal error: PDM.h: No such file or directory
compilation terminated.

examples/GetUUID

Result: FAIL

/home/ec2-user/arduino-testlib/cli-datadir/user/libraries/Picovoice_DE/src/utility/pv_audio_rec.cpp:15:17: fatal error: PDM.h: No such file or directory
compilation terminated.

examples/PicovoiceExample

Result: FAIL

/home/ec2-user/arduino-testlib/cli-datadir/user/libraries/Picovoice_DE/src/utility/pv_audio_rec.cpp:15:17: fatal error: PDM.h: No such file or directory
compilation terminated.