This report was generated on Wednesday, 23-Feb-22 22:48:15 CET using arduino-testlib.
Version: 1.0.0
More details
Board | Claims compatibility | Inclusion | LoggingGalore |
SerialToTelnet-Simplest |
SerialToTelnetAndWeb |
---|---|---|---|---|---|
arduino:avr:uno
1.8.4 |
No | FAIL | FAIL | FAIL | FAIL |
arduino:mbed_nano:nanorp2040connect
2.7.2 |
No | FAIL | FAIL | FAIL | FAIL |
arduino:megaavr:nona4809
1.8.7 |
No | FAIL | FAIL | FAIL | FAIL |
arduino:samd:mkrwifi1010
1.8.12 |
No | FAIL | FAIL | FAIL | FAIL |
esp32:esp32:d1_mini32
1.0.6 |
Yes | PASS | FAIL | FAIL | FAIL |
Result: FAIL
In file included from /tmp/arduino-testlib3910274024/test/test.ino:1:0: /home/ec2-user/arduino-testlib/cli-datadir/user/libraries/TLog/src/TLog.h:24:10: fatal error: memory: No such file or directory #include <memory> ^~~~~~~~ compilation terminated.
Result: FAIL
/home/ec2-user/arduino-testlib/cli-datadir/user/libraries/TLog/examples/LoggingGalore/LoggingGalore.ino:21:10: fatal error: ESPmDNS.h: No such file or directory #include <ESPmDNS.h> ^~~~~~~~~~~ compilation terminated. Multiple libraries were found for "WiFi.h" Used: /home/ec2-user/arduino-testlib/cli-datadir/user/libraries/WiFi Not used: /home/ec2-user/arduino-testlib/cli-datadir/user/libraries/Seeed_Arduino_rpcWiFi Not used: /home/ec2-user/arduino-testlib/cli-datadir/user/libraries/WiFiEspAT Not used: /home/ec2-user/arduino-testlib/cli-datadir/user/libraries/WiFiNINA
Result: FAIL
/home/ec2-user/arduino-testlib/cli-datadir/user/libraries/TLog/examples/SerialToTelnet-Simplest/SerialToTelnet-Simplest.ino:21:10: fatal error: ESPmDNS.h: No such file or directory #include <ESPmDNS.h> // advertize our service on Zeroconf/mDNS/Bonjour ^~~~~~~~~~~ compilation terminated. Multiple libraries were found for "WiFi.h" Used: /home/ec2-user/arduino-testlib/cli-datadir/user/libraries/WiFi Not used: /home/ec2-user/arduino-testlib/cli-datadir/user/libraries/Seeed_Arduino_rpcWiFi Not used: /home/ec2-user/arduino-testlib/cli-datadir/user/libraries/WiFiEspAT Not used: /home/ec2-user/arduino-testlib/cli-datadir/user/libraries/WiFiNINA
Result: FAIL
/home/ec2-user/arduino-testlib/cli-datadir/user/libraries/TLog/examples/SerialToTelnetAndWeb/SerialToTelnetAndWeb.ino:21:10: fatal error: ESPmDNS.h: No such file or directory #include <ESPmDNS.h> // advertize our service on Zeroconf/mDNS/Bonjour ^~~~~~~~~~~ compilation terminated. Multiple libraries were found for "WiFi.h" Used: /home/ec2-user/arduino-testlib/cli-datadir/user/libraries/WiFi Not used: /home/ec2-user/arduino-testlib/cli-datadir/user/libraries/Seeed_Arduino_rpcWiFi Not used: /home/ec2-user/arduino-testlib/cli-datadir/user/libraries/WiFiNINA Not used: /home/ec2-user/arduino-testlib/cli-datadir/user/libraries/WiFiEspAT
Result: FAIL
/home/ec2-user/arduino-testlib/cli-datadir/user/libraries/TLog/src/TelnetSerialStream.cpp:22:10: fatal error: ESPmDNS.h: No such file or directory #include <ESPmDNS.h> ^~~~~~~~~~~ compilation terminated. Multiple libraries were found for "WiFi.h" Used: /home/ec2-user/arduino-testlib/cli-datadir/user/libraries/WiFi Not used: /home/ec2-user/arduino-testlib/cli-datadir/user/libraries/WiFiNINA Not used: /home/ec2-user/arduino-testlib/cli-datadir/user/libraries/Seeed_Arduino_rpcWiFi Not used: /home/ec2-user/arduino-testlib/cli-datadir/user/libraries/WiFiEspAT Multiple libraries were found for "PubSubClient.h" Used: /home/ec2-user/arduino-testlib/cli-datadir/user/libraries/PubSubClient Not used: /home/ec2-user/arduino-testlib/cli-datadir/user/libraries/AIS_4G_board Not used: /home/ec2-user/arduino-testlib/cli-datadir/user/libraries/ESP8266_Microgear Not used: /home/ec2-user/arduino-testlib/cli-datadir/user/libraries/ACS-M1128 Not used: /home/ec2-user/arduino-testlib/cli-datadir/user/libraries/Antares_ESP8266_MQTT Not used: /home/ec2-user/arduino-testlib/cli-datadir/user/libraries/AzureIoTHubMQTTClient Not used: /home/ec2-user/arduino-testlib/cli-datadir/user/libraries/AllThingsTalk_WiFi_SDK Not used: /home/ec2-user/arduino-testlib/cli-datadir/user/libraries/CMMC_MQTT_Connector
Result: FAIL
/home/ec2-user/arduino-testlib/cli-datadir/user/libraries/TLog/examples/LoggingGalore/LoggingGalore.ino:21:10: fatal error: ESPmDNS.h: No such file or directory #include <ESPmDNS.h> ^~~~~~~~~~~ compilation terminated. Multiple libraries were found for "WiFi.h" Used: /home/ec2-user/arduino-testlib/cli-datadir/user/libraries/WiFi Not used: /home/ec2-user/arduino-testlib/cli-datadir/user/libraries/Seeed_Arduino_rpcWiFi Not used: /home/ec2-user/arduino-testlib/cli-datadir/user/libraries/WiFiNINA Not used: /home/ec2-user/arduino-testlib/cli-datadir/user/libraries/WiFiEspAT
Result: FAIL
/home/ec2-user/arduino-testlib/cli-datadir/user/libraries/TLog/examples/SerialToTelnet-Simplest/SerialToTelnet-Simplest.ino:21:10: fatal error: ESPmDNS.h: No such file or directory #include <ESPmDNS.h> // advertize our service on Zeroconf/mDNS/Bonjour ^~~~~~~~~~~ compilation terminated. Multiple libraries were found for "WiFi.h" Used: /home/ec2-user/arduino-testlib/cli-datadir/user/libraries/WiFi Not used: /home/ec2-user/arduino-testlib/cli-datadir/user/libraries/Seeed_Arduino_rpcWiFi Not used: /home/ec2-user/arduino-testlib/cli-datadir/user/libraries/WiFiNINA Not used: /home/ec2-user/arduino-testlib/cli-datadir/user/libraries/WiFiEspAT
Result: FAIL
/home/ec2-user/arduino-testlib/cli-datadir/user/libraries/TLog/examples/SerialToTelnetAndWeb/SerialToTelnetAndWeb.ino:21:10: fatal error: ESPmDNS.h: No such file or directory #include <ESPmDNS.h> // advertize our service on Zeroconf/mDNS/Bonjour ^~~~~~~~~~~ compilation terminated. Multiple libraries were found for "WiFi.h" Used: /home/ec2-user/arduino-testlib/cli-datadir/user/libraries/WiFi Not used: /home/ec2-user/arduino-testlib/cli-datadir/user/libraries/WiFiEspAT Not used: /home/ec2-user/arduino-testlib/cli-datadir/user/libraries/Seeed_Arduino_rpcWiFi Not used: /home/ec2-user/arduino-testlib/cli-datadir/user/libraries/WiFiNINA
Result: FAIL
In file included from /tmp/arduino-testlib2658642183/test/test.ino:1:0: /home/ec2-user/arduino-testlib/cli-datadir/user/libraries/TLog/src/TLog.h:24:10: fatal error: memory: No such file or directory #include <memory> ^~~~~~~~ compilation terminated.
Result: FAIL
/home/ec2-user/arduino-testlib/cli-datadir/user/libraries/TLog/examples/LoggingGalore/LoggingGalore.ino:21:10: fatal error: ESPmDNS.h: No such file or directory #include <ESPmDNS.h> ^~~~~~~~~~~ compilation terminated. Multiple libraries were found for "WiFi.h" Used: /home/ec2-user/arduino-testlib/cli-datadir/user/libraries/WiFi Not used: /home/ec2-user/arduino-testlib/cli-datadir/user/libraries/WiFiEspAT Not used: /home/ec2-user/arduino-testlib/cli-datadir/user/libraries/Seeed_Arduino_rpcWiFi Not used: /home/ec2-user/arduino-testlib/cli-datadir/user/libraries/WiFiNINA
Result: FAIL
/home/ec2-user/arduino-testlib/cli-datadir/user/libraries/TLog/examples/SerialToTelnet-Simplest/SerialToTelnet-Simplest.ino:21:10: fatal error: ESPmDNS.h: No such file or directory #include <ESPmDNS.h> // advertize our service on Zeroconf/mDNS/Bonjour ^~~~~~~~~~~ compilation terminated. Multiple libraries were found for "WiFi.h" Used: /home/ec2-user/arduino-testlib/cli-datadir/user/libraries/WiFi Not used: /home/ec2-user/arduino-testlib/cli-datadir/user/libraries/WiFiNINA Not used: /home/ec2-user/arduino-testlib/cli-datadir/user/libraries/WiFiEspAT Not used: /home/ec2-user/arduino-testlib/cli-datadir/user/libraries/Seeed_Arduino_rpcWiFi
Result: FAIL
/home/ec2-user/arduino-testlib/cli-datadir/user/libraries/TLog/examples/SerialToTelnetAndWeb/SerialToTelnetAndWeb.ino:21:10: fatal error: ESPmDNS.h: No such file or directory #include <ESPmDNS.h> // advertize our service on Zeroconf/mDNS/Bonjour ^~~~~~~~~~~ compilation terminated. Multiple libraries were found for "WiFi.h" Used: /home/ec2-user/arduino-testlib/cli-datadir/user/libraries/WiFi Not used: /home/ec2-user/arduino-testlib/cli-datadir/user/libraries/WiFiNINA Not used: /home/ec2-user/arduino-testlib/cli-datadir/user/libraries/WiFiEspAT Not used: /home/ec2-user/arduino-testlib/cli-datadir/user/libraries/Seeed_Arduino_rpcWiFi
Result: FAIL
/home/ec2-user/arduino-testlib/cli-datadir/user/libraries/TLog/src/TelnetSerialStream.cpp:22:10: fatal error: ESPmDNS.h: No such file or directory #include <ESPmDNS.h> ^~~~~~~~~~~ compilation terminated. Multiple libraries were found for "WiFi.h" Used: /home/ec2-user/arduino-testlib/cli-datadir/user/libraries/WiFi Not used: /home/ec2-user/arduino-testlib/cli-datadir/user/libraries/WiFiEspAT Not used: /home/ec2-user/arduino-testlib/cli-datadir/user/libraries/WiFiNINA Not used: /home/ec2-user/arduino-testlib/cli-datadir/user/libraries/Seeed_Arduino_rpcWiFi Multiple libraries were found for "PubSubClient.h" Used: /home/ec2-user/arduino-testlib/cli-datadir/user/libraries/PubSubClient Not used: /home/ec2-user/arduino-testlib/cli-datadir/user/libraries/CMMC_MQTT_Connector Not used: /home/ec2-user/arduino-testlib/cli-datadir/user/libraries/ESP8266_Microgear Not used: /home/ec2-user/arduino-testlib/cli-datadir/user/libraries/Antares_ESP8266_MQTT Not used: /home/ec2-user/arduino-testlib/cli-datadir/user/libraries/AllThingsTalk_WiFi_SDK Not used: /home/ec2-user/arduino-testlib/cli-datadir/user/libraries/ACS-M1128 Not used: /home/ec2-user/arduino-testlib/cli-datadir/user/libraries/AIS_4G_board Not used: /home/ec2-user/arduino-testlib/cli-datadir/user/libraries/AzureIoTHubMQTTClient
Result: FAIL
/home/ec2-user/arduino-testlib/cli-datadir/user/libraries/TLog/examples/LoggingGalore/LoggingGalore.ino:21:10: fatal error: ESPmDNS.h: No such file or directory #include <ESPmDNS.h> ^~~~~~~~~~~ compilation terminated. Multiple libraries were found for "WiFi.h" Used: /home/ec2-user/arduino-testlib/cli-datadir/user/libraries/WiFi Not used: /home/ec2-user/arduino-testlib/cli-datadir/user/libraries/Seeed_Arduino_rpcWiFi Not used: /home/ec2-user/arduino-testlib/cli-datadir/user/libraries/WiFiNINA Not used: /home/ec2-user/arduino-testlib/cli-datadir/user/libraries/WiFiEspAT
Result: FAIL
/home/ec2-user/arduino-testlib/cli-datadir/user/libraries/TLog/examples/SerialToTelnet-Simplest/SerialToTelnet-Simplest.ino:21:10: fatal error: ESPmDNS.h: No such file or directory #include <ESPmDNS.h> // advertize our service on Zeroconf/mDNS/Bonjour ^~~~~~~~~~~ compilation terminated. Multiple libraries were found for "WiFi.h" Used: /home/ec2-user/arduino-testlib/cli-datadir/user/libraries/WiFi Not used: /home/ec2-user/arduino-testlib/cli-datadir/user/libraries/Seeed_Arduino_rpcWiFi Not used: /home/ec2-user/arduino-testlib/cli-datadir/user/libraries/WiFiEspAT Not used: /home/ec2-user/arduino-testlib/cli-datadir/user/libraries/WiFiNINA
Result: FAIL
/home/ec2-user/arduino-testlib/cli-datadir/user/libraries/TLog/examples/SerialToTelnetAndWeb/SerialToTelnetAndWeb.ino:21:10: fatal error: ESPmDNS.h: No such file or directory #include <ESPmDNS.h> // advertize our service on Zeroconf/mDNS/Bonjour ^~~~~~~~~~~ compilation terminated. Multiple libraries were found for "WiFi.h" Used: /home/ec2-user/arduino-testlib/cli-datadir/user/libraries/WiFi Not used: /home/ec2-user/arduino-testlib/cli-datadir/user/libraries/WiFiEspAT Not used: /home/ec2-user/arduino-testlib/cli-datadir/user/libraries/Seeed_Arduino_rpcWiFi Not used: /home/ec2-user/arduino-testlib/cli-datadir/user/libraries/WiFiNINA
Result: PASS
Sketch uses 324214 bytes (24%) of program storage space. Maximum is 1310720 bytes. Global variables use 16068 bytes (4%) of dynamic memory, leaving 311612 bytes for local variables. Maximum is 327680 bytes.
Result: FAIL
/home/ec2-user/arduino-testlib/cli-datadir/user/libraries/TLog/examples/LoggingGalore/LoggingGalore.ino: In function 'void setup()': /home/ec2-user/arduino-testlib/cli-datadir/user/libraries/TLog/examples/LoggingGalore/LoggingGalore.ino:65:14: error: 'WIFI_NETWORK' was not declared in this scope WiFi.begin(WIFI_NETWORK, WIFI_PASSWD); ^ /home/ec2-user/arduino-testlib/cli-datadir/user/libraries/TLog/examples/LoggingGalore/LoggingGalore.ino:65:28: error: 'WIFI_PASSWD' was not declared in this scope WiFi.begin(WIFI_NETWORK, WIFI_PASSWD); ^ Multiple libraries were found for "WebServer.h" Used: /home/ec2-user/arduino-testlib/cli-datadir/data/packages/esp32/hardware/esp32/1.0.6/libraries/WebServer Not used: /home/ec2-user/arduino-testlib/cli-datadir/user/libraries/Seeed_Arduino_rpcWiFi Not used: /home/ec2-user/arduino-testlib/cli-datadir/user/libraries/ESPEssentials Multiple libraries were found for "PubSubClient.h" Used: /home/ec2-user/arduino-testlib/cli-datadir/user/libraries/PubSubClient Not used: /home/ec2-user/arduino-testlib/cli-datadir/user/libraries/Antares_ESP8266_MQTT Not used: /home/ec2-user/arduino-testlib/cli-datadir/user/libraries/ACS-M1128 Not used: /home/ec2-user/arduino-testlib/cli-datadir/user/libraries/AIS_4G_board Not used: /home/ec2-user/arduino-testlib/cli-datadir/user/libraries/ESP8266_Microgear Not used: /home/ec2-user/arduino-testlib/cli-datadir/user/libraries/CMMC_MQTT_Connector Not used: /home/ec2-user/arduino-testlib/cli-datadir/user/libraries/AzureIoTHubMQTTClient Not used: /home/ec2-user/arduino-testlib/cli-datadir/user/libraries/AllThingsTalk_WiFi_SDK Multiple libraries were found for "WiFi.h" Used: /home/ec2-user/arduino-testlib/cli-datadir/data/packages/esp32/hardware/esp32/1.0.6/libraries/WiFi Not used: /home/ec2-user/arduino-testlib/cli-datadir/user/libraries/WiFiEspAT Not used: /home/ec2-user/arduino-testlib/cli-datadir/user/libraries/WiFi Not used: /home/ec2-user/arduino-testlib/cli-datadir/user/libraries/Seeed_Arduino_rpcWiFi Not used: /home/ec2-user/arduino-testlib/cli-datadir/user/libraries/WiFiNINA
Result: FAIL
/home/ec2-user/arduino-testlib/cli-datadir/user/libraries/TLog/examples/SerialToTelnet-Simplest/SerialToTelnet-Simplest.ino: In function 'void setup()': /home/ec2-user/arduino-testlib/cli-datadir/user/libraries/TLog/examples/SerialToTelnet-Simplest/SerialToTelnet-Simplest.ino:55:14: error: 'WIFI_NETWORK' was not declared in this scope WiFi.begin(WIFI_NETWORK, WIFI_PASSWD); ^ /home/ec2-user/arduino-testlib/cli-datadir/user/libraries/TLog/examples/SerialToTelnet-Simplest/SerialToTelnet-Simplest.ino:55:28: error: 'WIFI_PASSWD' was not declared in this scope WiFi.begin(WIFI_NETWORK, WIFI_PASSWD); ^ Multiple libraries were found for "WiFi.h" Used: /home/ec2-user/arduino-testlib/cli-datadir/data/packages/esp32/hardware/esp32/1.0.6/libraries/WiFi Not used: /home/ec2-user/arduino-testlib/cli-datadir/user/libraries/WiFi Not used: /home/ec2-user/arduino-testlib/cli-datadir/user/libraries/WiFiNINA Not used: /home/ec2-user/arduino-testlib/cli-datadir/user/libraries/Seeed_Arduino_rpcWiFi Not used: /home/ec2-user/arduino-testlib/cli-datadir/user/libraries/WiFiEspAT Multiple libraries were found for "PubSubClient.h" Used: /home/ec2-user/arduino-testlib/cli-datadir/user/libraries/PubSubClient Not used: /home/ec2-user/arduino-testlib/cli-datadir/user/libraries/AzureIoTHubMQTTClient Not used: /home/ec2-user/arduino-testlib/cli-datadir/user/libraries/AIS_4G_board Not used: /home/ec2-user/arduino-testlib/cli-datadir/user/libraries/ESP8266_Microgear Not used: /home/ec2-user/arduino-testlib/cli-datadir/user/libraries/Antares_ESP8266_MQTT Not used: /home/ec2-user/arduino-testlib/cli-datadir/user/libraries/ACS-M1128 Not used: /home/ec2-user/arduino-testlib/cli-datadir/user/libraries/AllThingsTalk_WiFi_SDK Not used: /home/ec2-user/arduino-testlib/cli-datadir/user/libraries/CMMC_MQTT_Connector Multiple libraries were found for "WebServer.h" Used: /home/ec2-user/arduino-testlib/cli-datadir/data/packages/esp32/hardware/esp32/1.0.6/libraries/WebServer Not used: /home/ec2-user/arduino-testlib/cli-datadir/user/libraries/Seeed_Arduino_rpcWiFi Not used: /home/ec2-user/arduino-testlib/cli-datadir/user/libraries/ESPEssentials
Result: FAIL
/home/ec2-user/arduino-testlib/cli-datadir/user/libraries/TLog/examples/SerialToTelnetAndWeb/SerialToTelnetAndWeb.ino: In function 'void setup()': /home/ec2-user/arduino-testlib/cli-datadir/user/libraries/TLog/examples/SerialToTelnetAndWeb/SerialToTelnetAndWeb.ino:42:14: error: 'WIFI_NETWORK' was not declared in this scope WiFi.begin(WIFI_NETWORK, WIFI_PASSWD); ^ /home/ec2-user/arduino-testlib/cli-datadir/user/libraries/TLog/examples/SerialToTelnetAndWeb/SerialToTelnetAndWeb.ino:42:28: error: 'WIFI_PASSWD' was not declared in this scope WiFi.begin(WIFI_NETWORK, WIFI_PASSWD); ^ Multiple libraries were found for "WiFi.h" Used: /home/ec2-user/arduino-testlib/cli-datadir/data/packages/esp32/hardware/esp32/1.0.6/libraries/WiFi Not used: /home/ec2-user/arduino-testlib/cli-datadir/user/libraries/WiFiNINA Not used: /home/ec2-user/arduino-testlib/cli-datadir/user/libraries/WiFi Not used: /home/ec2-user/arduino-testlib/cli-datadir/user/libraries/WiFiEspAT Not used: /home/ec2-user/arduino-testlib/cli-datadir/user/libraries/Seeed_Arduino_rpcWiFi Multiple libraries were found for "WebServer.h" Used: /home/ec2-user/arduino-testlib/cli-datadir/data/packages/esp32/hardware/esp32/1.0.6/libraries/WebServer Not used: /home/ec2-user/arduino-testlib/cli-datadir/user/libraries/ESPEssentials Not used: /home/ec2-user/arduino-testlib/cli-datadir/user/libraries/Seeed_Arduino_rpcWiFi Multiple libraries were found for "PubSubClient.h" Used: /home/ec2-user/arduino-testlib/cli-datadir/user/libraries/PubSubClient Not used: /home/ec2-user/arduino-testlib/cli-datadir/user/libraries/ESP8266_Microgear Not used: /home/ec2-user/arduino-testlib/cli-datadir/user/libraries/AllThingsTalk_WiFi_SDK Not used: /home/ec2-user/arduino-testlib/cli-datadir/user/libraries/AzureIoTHubMQTTClient Not used: /home/ec2-user/arduino-testlib/cli-datadir/user/libraries/Antares_ESP8266_MQTT Not used: /home/ec2-user/arduino-testlib/cli-datadir/user/libraries/CMMC_MQTT_Connector Not used: /home/ec2-user/arduino-testlib/cli-datadir/user/libraries/AIS_4G_board Not used: /home/ec2-user/arduino-testlib/cli-datadir/user/libraries/ACS-M1128