This report was generated on Wednesday, 23-Feb-22 22:48:15 CET using arduino-testlib.
Version: 1.5.0
More details
Board | Claims compatibility | Inclusion | SerialTimer |
LedAndBuzzerShow |
RandomShining |
---|---|---|---|---|---|
arduino:avr:uno
1.8.4 |
Yes ⚠️ | FAIL | FAIL | FAIL | FAIL |
arduino:mbed_nano:nanorp2040connect
2.7.2 |
No | FAIL | FAIL | FAIL | FAIL |
arduino:megaavr:nona4809
1.8.7 |
No | FAIL | FAIL | FAIL | FAIL |
arduino:samd:mkrwifi1010
1.8.12 |
No | FAIL | FAIL | FAIL | FAIL |
esp32:esp32:d1_mini32
1.0.6 |
No | FAIL | FAIL | FAIL | FAIL |
Result: FAIL
In file included from /tmp/arduino-testlib4271471093/test/test.ino:1:0: /home/ec2-user/arduino-testlib/cli-datadir/user/libraries/TimersOneForAll/src/TimersOneForAll.h:2:10: fatal error: Internal\DoAfter.h: No such file or directory #include "Internal\DoAfter.h" ^~~~~~~~~~~~~~~~~~~~ compilation terminated.
Result: FAIL
In file included from /home/ec2-user/arduino-testlib/cli-datadir/user/libraries/TimersOneForAll/examples/LedAndBuzzerShow/LedAndBuzzerShow.ino:2:0: /home/ec2-user/arduino-testlib/cli-datadir/user/libraries/TimersOneForAll/src/TimersOneForAll.h:2:10: fatal error: Internal\DoAfter.h: No such file or directory #include "Internal\DoAfter.h" ^~~~~~~~~~~~~~~~~~~~ compilation terminated.
Result: FAIL
In file included from /home/ec2-user/arduino-testlib/cli-datadir/user/libraries/TimersOneForAll/examples/RandomShining/RandomShining.ino:1:0: /home/ec2-user/arduino-testlib/cli-datadir/user/libraries/TimersOneForAll/src/TimersOneForAll.h:2:10: fatal error: Internal\DoAfter.h: No such file or directory #include "Internal\DoAfter.h" ^~~~~~~~~~~~~~~~~~~~ compilation terminated.
Result: FAIL
In file included from /home/ec2-user/arduino-testlib/cli-datadir/user/libraries/TimersOneForAll/examples/SerialTimer/SerialTimer.ino:1:0: /home/ec2-user/arduino-testlib/cli-datadir/user/libraries/TimersOneForAll/src/TimersOneForAll.h:2:10: fatal error: Internal\DoAfter.h: No such file or directory #include "Internal\DoAfter.h" ^~~~~~~~~~~~~~~~~~~~ compilation terminated.
Result: FAIL
In file included from /tmp/arduino-testlib1139066097/test/test.ino:1:0: /home/ec2-user/arduino-testlib/cli-datadir/user/libraries/TimersOneForAll/src/TimersOneForAll.h:2:10: fatal error: Internal\DoAfter.h: No such file or directory #include "Internal\DoAfter.h" ^~~~~~~~~~~~~~~~~~~~ compilation terminated.
Result: FAIL
In file included from /home/ec2-user/arduino-testlib/cli-datadir/user/libraries/TimersOneForAll/examples/LedAndBuzzerShow/LedAndBuzzerShow.ino:2:0: /home/ec2-user/arduino-testlib/cli-datadir/user/libraries/TimersOneForAll/src/TimersOneForAll.h:2:10: fatal error: Internal\DoAfter.h: No such file or directory #include "Internal\DoAfter.h" ^~~~~~~~~~~~~~~~~~~~ compilation terminated.
Result: FAIL
In file included from /home/ec2-user/arduino-testlib/cli-datadir/user/libraries/TimersOneForAll/examples/RandomShining/RandomShining.ino:1:0: /home/ec2-user/arduino-testlib/cli-datadir/user/libraries/TimersOneForAll/src/TimersOneForAll.h:2:10: fatal error: Internal\DoAfter.h: No such file or directory #include "Internal\DoAfter.h" ^~~~~~~~~~~~~~~~~~~~ compilation terminated.
Result: FAIL
In file included from /home/ec2-user/arduino-testlib/cli-datadir/user/libraries/TimersOneForAll/examples/SerialTimer/SerialTimer.ino:1:0: /home/ec2-user/arduino-testlib/cli-datadir/user/libraries/TimersOneForAll/src/TimersOneForAll.h:2:10: fatal error: Internal\DoAfter.h: No such file or directory #include "Internal\DoAfter.h" ^~~~~~~~~~~~~~~~~~~~ compilation terminated.
Result: FAIL
In file included from /tmp/arduino-testlib1139066097/test/test.ino:1:0: /home/ec2-user/arduino-testlib/cli-datadir/user/libraries/TimersOneForAll/src/TimersOneForAll.h:2:10: fatal error: Internal\DoAfter.h: No such file or directory #include "Internal\DoAfter.h" ^~~~~~~~~~~~~~~~~~~~ compilation terminated.
Result: FAIL
In file included from /home/ec2-user/arduino-testlib/cli-datadir/user/libraries/TimersOneForAll/examples/LedAndBuzzerShow/LedAndBuzzerShow.ino:2:0: /home/ec2-user/arduino-testlib/cli-datadir/user/libraries/TimersOneForAll/src/TimersOneForAll.h:2:10: fatal error: Internal\DoAfter.h: No such file or directory #include "Internal\DoAfter.h" ^~~~~~~~~~~~~~~~~~~~ compilation terminated.
Result: FAIL
In file included from /home/ec2-user/arduino-testlib/cli-datadir/user/libraries/TimersOneForAll/examples/RandomShining/RandomShining.ino:1:0: /home/ec2-user/arduino-testlib/cli-datadir/user/libraries/TimersOneForAll/src/TimersOneForAll.h:2:10: fatal error: Internal\DoAfter.h: No such file or directory #include "Internal\DoAfter.h" ^~~~~~~~~~~~~~~~~~~~ compilation terminated.
Result: FAIL
In file included from /home/ec2-user/arduino-testlib/cli-datadir/user/libraries/TimersOneForAll/examples/SerialTimer/SerialTimer.ino:1:0: /home/ec2-user/arduino-testlib/cli-datadir/user/libraries/TimersOneForAll/src/TimersOneForAll.h:2:10: fatal error: Internal\DoAfter.h: No such file or directory #include "Internal\DoAfter.h" ^~~~~~~~~~~~~~~~~~~~ compilation terminated.
Result: FAIL
In file included from /tmp/arduino-testlib4271471093/test/test.ino:1:0: /home/ec2-user/arduino-testlib/cli-datadir/user/libraries/TimersOneForAll/src/TimersOneForAll.h:2:10: fatal error: Internal\DoAfter.h: No such file or directory #include "Internal\DoAfter.h" ^~~~~~~~~~~~~~~~~~~~ compilation terminated.
Result: FAIL
In file included from /home/ec2-user/arduino-testlib/cli-datadir/user/libraries/TimersOneForAll/examples/LedAndBuzzerShow/LedAndBuzzerShow.ino:2:0: /home/ec2-user/arduino-testlib/cli-datadir/user/libraries/TimersOneForAll/src/TimersOneForAll.h:2:10: fatal error: Internal\DoAfter.h: No such file or directory #include "Internal\DoAfter.h" ^~~~~~~~~~~~~~~~~~~~ compilation terminated.
Result: FAIL
In file included from /home/ec2-user/arduino-testlib/cli-datadir/user/libraries/TimersOneForAll/examples/RandomShining/RandomShining.ino:1:0: /home/ec2-user/arduino-testlib/cli-datadir/user/libraries/TimersOneForAll/src/TimersOneForAll.h:2:10: fatal error: Internal\DoAfter.h: No such file or directory #include "Internal\DoAfter.h" ^~~~~~~~~~~~~~~~~~~~ compilation terminated.
Result: FAIL
In file included from /home/ec2-user/arduino-testlib/cli-datadir/user/libraries/TimersOneForAll/examples/SerialTimer/SerialTimer.ino:1:0: /home/ec2-user/arduino-testlib/cli-datadir/user/libraries/TimersOneForAll/src/TimersOneForAll.h:2:10: fatal error: Internal\DoAfter.h: No such file or directory #include "Internal\DoAfter.h" ^~~~~~~~~~~~~~~~~~~~ compilation terminated.
Result: FAIL
In file included from /tmp/arduino-testlib1988728104/test/test.ino:1:0: /home/ec2-user/arduino-testlib/cli-datadir/user/libraries/TimersOneForAll/src/TimersOneForAll.h:2:30: fatal error: Internal\DoAfter.h: No such file or directory compilation terminated.
Result: FAIL
In file included from /home/ec2-user/arduino-testlib/cli-datadir/user/libraries/TimersOneForAll/examples/LedAndBuzzerShow/LedAndBuzzerShow.ino:2:0: /home/ec2-user/arduino-testlib/cli-datadir/user/libraries/TimersOneForAll/src/TimersOneForAll.h:2:30: fatal error: Internal\DoAfter.h: No such file or directory compilation terminated.
Result: FAIL
In file included from /home/ec2-user/arduino-testlib/cli-datadir/user/libraries/TimersOneForAll/examples/RandomShining/RandomShining.ino:1:0: /home/ec2-user/arduino-testlib/cli-datadir/user/libraries/TimersOneForAll/src/TimersOneForAll.h:2:30: fatal error: Internal\DoAfter.h: No such file or directory compilation terminated.
Result: FAIL
In file included from /home/ec2-user/arduino-testlib/cli-datadir/user/libraries/TimersOneForAll/examples/SerialTimer/SerialTimer.ino:1:0: /home/ec2-user/arduino-testlib/cli-datadir/user/libraries/TimersOneForAll/src/TimersOneForAll.h:2:30: fatal error: Internal\DoAfter.h: No such file or directory compilation terminated.