This report was generated on Wednesday, 23-Feb-22 22:48:15 CET using arduino-testlib.
Version: 1.0.1
More details
Board | Claims compatibility | Inclusion | NTC-10KD-5J |
TestModlinkFND |
---|---|---|---|---|
arduino:avr:uno
1.8.4 |
Yes ⚠️ | FAIL | FAIL | FAIL |
arduino:mbed_nano:nanorp2040connect
2.7.2 |
No | FAIL | FAIL | FAIL |
arduino:megaavr:nona4809
1.8.7 |
No | FAIL | FAIL | FAIL |
arduino:samd:mkrwifi1010
1.8.12 |
No | FAIL | FAIL | FAIL |
esp32:esp32:d1_mini32
1.0.6 |
No | FAIL | FAIL | FAIL |
Result: FAIL
This library has no main header file so an empty one was created.
/tmp/arduino-testlib1430267060/test/test.ino:1:10: fatal error: VitconLink.h: No such file or directory #include <VitconLink.h> ^~~~~~~~~~~~~~ compilation terminated.
Result: FAIL
/home/ec2-user/arduino-testlib/cli-datadir/user/libraries/VitconLink/ModlinkNTC.cpp:9:10: fatal error: Math.h: No such file or directory #include <Math.h> ^~~~~~~~ compilation terminated.
Result: FAIL
/home/ec2-user/arduino-testlib/cli-datadir/user/libraries/VitconLink/ModlinkNTC.cpp:9:10: fatal error: Math.h: No such file or directory #include <Math.h> ^~~~~~~~ compilation terminated.
Result: FAIL
This library has no main header file so an empty one was created.
/tmp/arduino-testlib345443925/test/test.ino:1:10: fatal error: VitconLink.h: No such file or directory #include <VitconLink.h> ^~~~~~~~~~~~~~ compilation terminated.
Result: FAIL
/home/ec2-user/arduino-testlib/cli-datadir/user/libraries/VitconLink/ModlinkNTC.cpp:9:10: fatal error: Math.h: No such file or directory #include <Math.h> ^~~~~~~~ compilation terminated.
Result: FAIL
/home/ec2-user/arduino-testlib/cli-datadir/user/libraries/VitconLink/ModlinkNTC.cpp:9:10: fatal error: Math.h: No such file or directory #include <Math.h> ^~~~~~~~ compilation terminated.
Result: FAIL
This library has no main header file so an empty one was created.
/tmp/arduino-testlib345443925/test/test.ino:1:10: fatal error: VitconLink.h: No such file or directory #include <VitconLink.h> ^~~~~~~~~~~~~~ compilation terminated.
Result: FAIL
/home/ec2-user/arduino-testlib/cli-datadir/user/libraries/VitconLink/ModlinkNTC.cpp:9:10: fatal error: Math.h: No such file or directory #include <Math.h> ^~~~~~~~ compilation terminated.
Result: FAIL
/home/ec2-user/arduino-testlib/cli-datadir/user/libraries/VitconLink/ModlinkNTC.cpp:9:10: fatal error: Math.h: No such file or directory #include <Math.h> ^~~~~~~~ compilation terminated.
Result: FAIL
This library has no main header file so an empty one was created.
/tmp/arduino-testlib1430267060/test/test.ino:1:10: fatal error: VitconLink.h: No such file or directory #include <VitconLink.h> ^~~~~~~~~~~~~~ compilation terminated.
Result: FAIL
/home/ec2-user/arduino-testlib/cli-datadir/user/libraries/VitconLink/ModlinkNTC.cpp:9:10: fatal error: Math.h: No such file or directory #include <Math.h> ^~~~~~~~ compilation terminated.
Result: FAIL
/home/ec2-user/arduino-testlib/cli-datadir/user/libraries/VitconLink/ModlinkNTC.cpp:9:10: fatal error: Math.h: No such file or directory #include <Math.h> ^~~~~~~~ compilation terminated.
Result: FAIL
This library has no main header file so an empty one was created.
/tmp/arduino-testlib2549422924/test/test.ino:1:24: fatal error: VitconLink.h: No such file or directory compilation terminated.
Result: FAIL
/home/ec2-user/arduino-testlib/cli-datadir/user/libraries/VitconLink/ModlinkNTC.cpp:9:18: fatal error: Math.h: No such file or directory compilation terminated.
Result: FAIL
/home/ec2-user/arduino-testlib/cli-datadir/user/libraries/VitconLink/ModlinkNTC.cpp:9:18: fatal error: Math.h: No such file or directory compilation terminated.