This report was generated on Wednesday, 23-Feb-22 22:48:15 CET using arduino-testlib.
Version: 1.0.4
More details
Board | Claims compatibility | Inclusion | ContinuousTOFA |
---|---|---|---|
arduino:avr:uno
1.8.4 |
Yes ⚠️ | FAIL | FAIL |
arduino:mbed_nano:nanorp2040connect
2.7.2 |
Yes ⚠️ | FAIL | FAIL |
arduino:megaavr:nona4809
1.8.7 |
Yes ⚠️ | FAIL | FAIL |
arduino:samd:mkrwifi1010
1.8.12 |
Yes ⚠️ | FAIL | FAIL |
esp32:esp32:d1_mini32
1.0.6 |
Yes ⚠️ | FAIL | FAIL |
Result: FAIL
/home/ec2-user/arduino-testlib/cli-datadir/user/libraries/vl53l0xTOFA/vl53l0xTOFA.cpp:9:10: fatal error: VL53L0xTOFA.h: No such file or directory #include "VL53L0xTOFA.h" ^~~~~~~~~~~~~~~ compilation terminated.
Result: FAIL
/home/ec2-user/arduino-testlib/cli-datadir/user/libraries/vl53l0xTOFA/vl53l0xTOFA.cpp:9:10: fatal error: VL53L0xTOFA.h: No such file or directory #include "VL53L0xTOFA.h" ^~~~~~~~~~~~~~~ compilation terminated.
Result: FAIL
/home/ec2-user/arduino-testlib/cli-datadir/user/libraries/vl53l0xTOFA/vl53l0xTOFA.cpp:9:10: fatal error: VL53L0xTOFA.h: No such file or directory #include "VL53L0xTOFA.h" ^~~~~~~~~~~~~~~ compilation terminated.
Result: FAIL
/home/ec2-user/arduino-testlib/cli-datadir/user/libraries/vl53l0xTOFA/vl53l0xTOFA.cpp:9:10: fatal error: VL53L0xTOFA.h: No such file or directory #include "VL53L0xTOFA.h" ^~~~~~~~~~~~~~~ compilation terminated.
Result: FAIL
/home/ec2-user/arduino-testlib/cli-datadir/user/libraries/vl53l0xTOFA/vl53l0xTOFA.cpp:9:10: fatal error: VL53L0xTOFA.h: No such file or directory #include "VL53L0xTOFA.h" ^~~~~~~~~~~~~~~ compilation terminated.
Result: FAIL
/home/ec2-user/arduino-testlib/cli-datadir/user/libraries/vl53l0xTOFA/vl53l0xTOFA.cpp:9:10: fatal error: VL53L0xTOFA.h: No such file or directory #include "VL53L0xTOFA.h" ^~~~~~~~~~~~~~~ compilation terminated.
Result: FAIL
/home/ec2-user/arduino-testlib/cli-datadir/user/libraries/vl53l0xTOFA/vl53l0xTOFA.cpp:9:10: fatal error: VL53L0xTOFA.h: No such file or directory #include "VL53L0xTOFA.h" ^~~~~~~~~~~~~~~ compilation terminated.
Result: FAIL
/home/ec2-user/arduino-testlib/cli-datadir/user/libraries/vl53l0xTOFA/vl53l0xTOFA.cpp:9:10: fatal error: VL53L0xTOFA.h: No such file or directory #include "VL53L0xTOFA.h" ^~~~~~~~~~~~~~~ compilation terminated.
Result: FAIL
/home/ec2-user/arduino-testlib/cli-datadir/user/libraries/vl53l0xTOFA/vl53l0xTOFA.cpp:9:25: fatal error: VL53L0xTOFA.h: No such file or directory compilation terminated.
Result: FAIL
/home/ec2-user/arduino-testlib/cli-datadir/user/libraries/vl53l0xTOFA/vl53l0xTOFA.cpp:9:25: fatal error: VL53L0xTOFA.h: No such file or directory compilation terminated.